项目执行mvn clean install命令,blade-flow 项目报错

Blade 未结 1 95
hello-world-55
hello-world-55 剑宗 2022-05-19 14:29

一、该问题的重现步骤是什么?

1. 在项目根目录执行mvn clean install命令,控制台会打印blade-flow启动日志,且项目启动报错,blade-flow项目编译失败image.pngimage.png

2. 如果在blade-flow项目的pom文件加入如下插件,执行命令时,还是会打印启动日志,并报错,但是编译成功

image.png

3.


二、你期待的结果是什么?实际看到的又是什么?

希望不用在pom文件加插件,执行mvn clean install命名,不会有blade-flow项目的启动日志,且编译成功


三、你正在使用的是什么产品,什么版本?在什么操作系统上?


四、请提供详细的错误堆栈信息,这很重要。

-------------------------------------------------------

 T E S T S

-------------------------------------------------------

Running org.springblade.flow.test.BladeTest

14:13:47.068 [main] DEBUG org.springframework.test.context.junit4.SpringJUnit4ClassRunner - SpringJUnit4ClassRunner constructor called with [class org.springblade.flow.test.BladeTest]

14:13:47.075 [main] DEBUG org.springframework.test.context.BootstrapUtils - Instantiating CacheAwareContextLoaderDelegate from class [org.springframework.test.context.cache.DefaultCacheAwareContextLoaderDelegate]

14:13:47.089 [main] DEBUG org.springframework.test.context.BootstrapUtils - Instantiating BootstrapContext using constructor [public org.springframework.test.context.support.DefaultBootstrapContext(java.lang.Class,org.springframework.test.context.CacheAwareContextLoaderDelegate)]

14:13:47.142 [main] DEBUG org.springframework.test.context.BootstrapUtils - Instantiating TestContextBootstrapper for test class [org.springblade.flow.test.BladeTest] from class [org.springframework.boot.test.context.SpringBootTestContextBootstrapper]

14:13:47.166 [main] INFO org.springframework.boot.test.context.SpringBootTestContextBootstrapper - Neither @ContextConfiguration nor @ContextHierarchy found for test class [org.springblade.flow.test.BladeTest], using SpringBootContextLoader

14:13:47.171 [main] DEBUG org.springframework.test.context.support.AbstractContextLoader - Did not detect default resource location for test class [org.springblade.flow.test.BladeTest]: class path resource [org/springblade/flow/test/BladeTest-context.xml] does not exist

14:13:47.171 [main] DEBUG org.springframework.test.context.support.AbstractContextLoader - Did not detect default resource location for test class [org.springblade.flow.test.BladeTest]: class path resource [org/springblade/flow/test/BladeTestContext.groovy] does not exist

14:13:47.172 [main] INFO org.springframework.test.context.support.AbstractContextLoader - Could not detect default resource locations for test class [org.springblade.flow.test.BladeTest]: no resource found for suffixes {-context.xml, Context.groovy}.

14:13:47.172 [main] INFO org.springframework.test.context.support.AnnotationConfigContextLoaderUtils - Could not detect default configuration classes for test class [org.springblade.flow.test.BladeTest]: BladeTest does not declare any static, non-private, non-final, nested classes annotated with @Configuration.

14:13:47.234 [main] DEBUG org.springframework.test.context.support.ActiveProfilesUtils - Could not find an 'annotation declaring class' for annotation type [org.springframework.test.context.ActiveProfiles] and class [org.springblade.flow.test.BladeTest]

14:13:47.324 [main] DEBUG org.springframework.context.annotation.ClassPathScanningCandidateComponentProvider - Identified candidate component class: file [D:\idea\bmkp\bmdj\bmkp-bmdj\blade-ops\blade-flow\target\classes\org\springblade\flow\FlowApplication.class]

14:13:47.325 [main] INFO org.springframework.boot.test.context.SpringBootTestContextBootstrapper - Found @SpringBootConfiguration org.springblade.flow.FlowApplication for test class org.springblade.flow.test.BladeTest

14:13:47.476 [main] DEBUG org.springframework.boot.test.context.SpringBootTestContextBootstrapper - @TestExecutionListeners is not present for class [org.springblade.flow.test.BladeTest]: using defaults.

14:13:47.476 [main] INFO org.springframework.boot.test.context.SpringBootTestContextBootstrapper - Loaded default TestExecutionListener class names from location [META-INF/spring.factories]: [org.springframework.boot.test.mock.mockito.MockitoTestExecutionListener, org.springframework.boot.test.mock.mockito.ResetMocksTestExecutionListener, org.springframework.boot.test.autoconfigure.restdocs.RestDocsTestExecutionListener, org.springframework.boot.test.autoconfigure.web.client.MockRestServiceServerResetTestExecutionListener, org.springframework.boot.test.autoconfigure.web.servlet.MockMvcPrintOnlyOnFailureTestExecutionListener, org.springframework.boot.test.autoconfigure.web.servlet.WebDriverTestExecutionListener, org.springframework.boot.test.autoconfigure.webservices.client.MockWebServiceServerTestExecutionListener, org.springframework.test.context.web.ServletTestExecutionListener, org.springframework.test.context.support.DirtiesContextBeforeModesTestExecutionListener, org.springframework.test.context.support.DependencyInjectionTestExecutionListener, org.springframework.test.context.support.DirtiesContextTestExecutionListener, org.springframework.test.context.transaction.TransactionalTestExecutionListener, org.springframework.test.context.jdbc.SqlScriptsTestExecutionListener, org.springframework.test.context.event.EventPublishingTestExecutionListener]

14:13:47.507 [main] INFO org.springframework.boot.test.context.SpringBootTestContextBootstrapper - Using TestExecutionListeners: [org.springframework.test.context.web.ServletTestExecutionListener@1cb6996, org.springframework.test.context.support.DirtiesContextBeforeModesTestExecutionListener@7e3f6, org.springframework.boot.test.mock.mockito.MockitoTestExecutionListener@d3575, org.springframework.boot.test.autoconfigure.SpringBootDependencyInjectionTestExecutionListener@11da57d, org.springframework.test.context.support.DirtiesContextTestExecutionListener@194fad1, org.springframework.test.context.transaction.TransactionalTestExecutionListener@abb146, org.springframework.test.context.jdbc.SqlScriptsTestExecutionListener@12c8e7b, org.springframework.test.context.event.EventPublishingTestExecutionListener@1f8f5ae, org.springframework.boot.test.mock.mockito.ResetMocksTestExecutionListener@11cd9b2, org.springframework.boot.test.autoconfigure.restdocs.RestDocsTestExecutionListener@467116, org.springframework.boot.test.autoconfigure.web.client.MockRestServiceServerResetTestExecutionListener@17a7f33, org.springframework.boot.test.autoconfigure.web.servlet.MockMvcPrintOnlyOnFailureTestExecutionListener@10da477, org.springframework.boot.test.autoconfigure.web.servlet.WebDriverTestExecutionListener@7933ad, org.springframework.boot.test.autoconfigure.webservices.client.MockWebServiceServerTestExecutionListener@1bc27f5]

---[junit.test]:[blade-flow]---启动中,读取到的环境变量:[dev]

14:13:47.559 [main] DEBUG org.springframework.test.annotation.ProfileValueUtils - Retrieved @ProfileValueSourceConfiguration [null] for test class [org.springblade.flow.test.BladeTest]

14:13:47.561 [main] DEBUG org.springframework.test.annotation.ProfileValueUtils - Retrieved ProfileValueSource type [class org.springframework.test.annotation.SystemProfileValueSource] for class [org.springblade.flow.test.BladeTest]

14:13:47.562 [main] DEBUG org.springframework.test.annotation.ProfileValueUtils - Retrieved @ProfileValueSourceConfiguration [null] for test class [org.springblade.flow.test.BladeTest]

14:13:47.562 [main] DEBUG org.springframework.test.annotation.ProfileValueUtils - Retrieved ProfileValueSource type [class org.springframework.test.annotation.SystemProfileValueSource] for class [org.springblade.flow.test.BladeTest]

14:13:47.562 [main] DEBUG org.springframework.test.annotation.ProfileValueUtils - Retrieved @ProfileValueSourceConfiguration [null] for test class [org.springblade.flow.test.BladeTest]

14:13:47.562 [main] DEBUG org.springframework.test.annotation.ProfileValueUtils - Retrieved ProfileValueSource type [class org.springframework.test.annotation.SystemProfileValueSource] for class [org.springblade.flow.test.BladeTest]

14:13:47.563 [main] DEBUG org.springframework.test.annotation.ProfileValueUtils - Retrieved @ProfileValueSourceConfiguration [null] for test class [org.springblade.flow.test.BladeTest]

14:13:47.563 [main] DEBUG org.springframework.test.annotation.ProfileValueUtils - Retrieved ProfileValueSource type [class org.springframework.test.annotation.SystemProfileValueSource] for class [org.springblade.flow.test.BladeTest]

14:13:47.572 [main] DEBUG org.springframework.test.context.support.AbstractDirtiesContextTestExecutionListener - Before test class: context [DefaultTestContext@570ded testClass = BladeTest, testInstance = [null], testMethod = [null], testException = [null], mergedContextConfiguration = [WebMergedContextConfiguration@186de0d testClass = BladeTest, locations = '{}', classes = '{class org.springblade.flow.FlowApplication}', contextInitializerClasses = '[]', activeProfiles = '{}', propertySourceLocations = '{}', propertySourceProperties = '{org.springframework.boot.test.context.SpringBootTestContextBootstrapper=true}', contextCustomizers = set[org.springframework.boot.test.context.filter.ExcludeFilterContextCustomizer@eaa59a, org.springframework.boot.test.json.DuplicateJsonObjectContextCustomizerFactory$DuplicateJsonObjectContextCustomizer@1fbdac4, org.springframework.boot.test.mock.mockito.MockitoContextCustomizer@0, org.springframework.boot.test.web.client.TestRestTemplateContextCustomizer@1195e57, org.springframework.boot.test.autoconfigure.properties.PropertyMappingContextCustomizer@0, org.springframework.boot.test.autoconfigure.web.servlet.WebDriverContextCustomizerFactory$Customizer@e52303, org.springframework.boot.test.context.SpringBootTestArgs@1, org.springframework.boot.test.context.SpringBootTestWebEnvironment@1930714], resourceBasePath = 'src/main/webapp', contextLoader = 'org.springframework.boot.test.context.SpringBootContextLoader', parent = [null]], attributes = map['org.springframework.test.context.web.ServletTestExecutionListener.activateListener' -> true]], class annotated with @DirtiesContext [false] with mode [null].

14:13:47.575 [main] DEBUG org.springframework.test.annotation.ProfileValueUtils - Retrieved @ProfileValueSourceConfiguration [null] for test class [org.springblade.flow.test.BladeTest]

14:13:47.575 [main] DEBUG org.springframework.test.annotation.ProfileValueUtils - Retrieved ProfileValueSource type [class org.springframework.test.annotation.SystemProfileValueSource] for class [org.springblade.flow.test.BladeTest]

14:13:47.578 [main] DEBUG org.springframework.test.context.support.TestPropertySourceUtils - Adding inlined properties to environment: {spring.jmx.enabled=false, org.springframework.boot.test.context.SpringBootTestContextBootstrapper=true}

2022-05-19 14:13:49.435  INFO 29080 --- [kground-preinit] o.h.validator.internal.util.Version      : HV000001: Hibernate Validator 6.1.7.Final

2022-05-19 14:13:49.967  WARN 29080 --- [kground-preinit] o.s.h.c.j.Jackson2ObjectMapperBuilder    : For Jackson Kotlin classes support please add "com.fasterxml.jackson.module:jackson-module-kotlin" to the classpath

                   ______  _             _       ___   ___

                   | ___ \| |           | |      \  \ /  /

                   | |_/ /| |  __ _   __| |  ___  \  V  /

                   | ___ \| | / _` | / _` | / _ \   > <

                   | |_/ /| || (_| || (_| ||  __/ /  .  \

                   \____/ |_| \__,_| \__,_| \___|/__/ \__\


:: BladeX 2.9.1.RELEASE :: blade-flow:dev :: Running SpringBoot 2.3.12.RELEASE ::


2022-05-19 14:13:50.977  INFO 29080 --- [           main] org.reflections.Reflections              : Reflections took 38 ms to scan 1 urls, producing 3 keys and 6 values

2022-05-19 14:13:51.012  INFO 29080 --- [           main] org.reflections.Reflections              : Reflections took 15 ms to scan 1 urls, producing 4 keys and 9 values

2022-05-19 14:13:51.026  INFO 29080 --- [           main] org.reflections.Reflections              : Reflections took 13 ms to scan 1 urls, producing 3 keys and 10 values

2022-05-19 14:13:51.047  INFO 29080 --- [           main] org.reflections.Reflections              : Reflections took 18 ms to scan 13 urls, producing 0 keys and 0 values

2022-05-19 14:13:51.060  INFO 29080 --- [           main] org.reflections.Reflections              : Reflections took 12 ms to scan 1 urls, producing 1 keys and 5 values

2022-05-19 14:13:51.071  INFO 29080 --- [           main] org.reflections.Reflections              : Reflections took 9 ms to scan 1 urls, producing 1 keys and 7 values

2022-05-19 14:13:51.084  INFO 29080 --- [           main] org.reflections.Reflections              : Reflections took 9 ms to scan 1 urls, producing 2 keys and 8 values

2022-05-19 14:13:51.103  INFO 29080 --- [           main] org.reflections.Reflections              : Reflections took 15 ms to scan 13 urls, producing 0 keys and 0 values

2022-05-19 14:13:54.899 ERROR 29080 --- [           main] c.a.n.c.remote.client.grpc.GrpcClient    : Server check fail, please check server 127.0.0.1 ,port 9848 is available , error ={}


java.util.concurrent.ExecutionException: com.alibaba.nacos.shaded.io.grpc.StatusRuntimeException: UNAVAILABLE: io exception

        at com.alibaba.nacos.shaded.com.google.common.util.concurrent.AbstractFuture.getDoneValue(AbstractFuture.java:566)

        at com.alibaba.nacos.shaded.com.google.common.util.concurrent.AbstractFuture.get(AbstractFuture.java:445)

        at com.alibaba.nacos.common.remote.client.grpc.GrpcClient.serverCheck(GrpcClient.java:148)

        at com.alibaba.nacos.common.remote.client.grpc.GrpcClient.connectToServer(GrpcClient.java:264)

        at com.alibaba.nacos.common.remote.client.RpcClient.start(RpcClient.java:390)

        at com.alibaba.nacos.client.config.impl.ClientWorker$ConfigRpcTransportClient.ensureRpcClient(ClientWorker.java:885)

        at com.alibaba.nacos.client.config.impl.ClientWorker$ConfigRpcTransportClient.getOneRunningClient(ClientWorker.java:1044)

        at com.alibaba.nacos.client.config.impl.ClientWorker$ConfigRpcTransportClient.queryConfig(ClientWorker.java:940)

        at com.alibaba.nacos.client.config.impl.ClientWorker.getServerConfig(ClientWorker.java:397)

        at com.alibaba.nacos.client.config.NacosConfigService.getConfigInner(NacosConfigService.java:166)

        at com.alibaba.nacos.client.config.NacosConfigService.getConfig(NacosConfigService.java:94)

        at com.alibaba.cloud.nacos.client.NacosPropertySourceBuilder.loadNacosData(NacosPropertySourceBuilder.java:85)

        at com.alibaba.cloud.nacos.client.NacosPropertySourceBuilder.build(NacosPropertySourceBuilder.java:73)

        at com.alibaba.cloud.nacos.client.NacosPropertySourceLocator.loadNacosPropertySource(NacosPropertySourceLocator.java:199)

        at com.alibaba.cloud.nacos.client.NacosPropertySourceLocator.loadNacosDataIfPresent(NacosPropertySourceLocator.java:186)

        at com.alibaba.cloud.nacos.client.NacosPropertySourceLocator.loadNacosConfiguration(NacosPropertySourceLocator.java:158)

        at com.alibaba.cloud.nacos.client.NacosPropertySourceLocator.loadSharedConfiguration(NacosPropertySourceLocator.java:116)

        at com.alibaba.cloud.nacos.client.NacosPropertySourceLocator.locate(NacosPropertySourceLocator.java:101)

        at org.springframework.cloud.bootstrap.config.PropertySourceLocator.locateCollection(PropertySourceLocator.java:52)

        at org.springframework.cloud.bootstrap.config.PropertySourceLocator.locateCollection(PropertySourceLocator.java:47)

        at org.springframework.cloud.bootstrap.config.PropertySourceBootstrapConfiguration.initialize(PropertySourceBootstrapConfiguration.java:98)

        at org.springframework.boot.SpringApplication.applyInitializers(SpringApplication.java:623)

        at org.springframework.boot.SpringApplication.prepareContext(SpringApplication.java:367)

        at org.springframework.boot.SpringApplication.run(SpringApplication.java:311)

        at org.springframework.boot.test.context.SpringBootContextLoader.loadContext(SpringBootContextLoader.java:120)

        at org.springframework.test.context.cache.DefaultCacheAwareContextLoaderDelegate.loadContextInternal(DefaultCacheAwareContextLoaderDelegate.java:99)

        at org.springframework.test.context.cache.DefaultCacheAwareContextLoaderDelegate.loadContext(DefaultCacheAwareContextLoaderDelegate.java:124)

        at org.springframework.test.context.support.DefaultTestContext.getApplicationContext(DefaultTestContext.java:123)

        at org.springframework.test.context.web.ServletTestExecutionListener.setUpRequestContextIfNecessary(ServletTestExecutionListener.java:190)

        at org.springframework.test.context.web.ServletTestExecutionListener.prepareTestInstance(ServletTestExecutionListener.java:132)

        at org.springframework.test.context.TestContextManager.prepareTestInstance(TestContextManager.java:244)

        at org.springframework.test.context.junit4.SpringJUnit4ClassRunner.createTest(SpringJUnit4ClassRunner.java:227)

        at org.springframework.test.context.junit4.SpringJUnit4ClassRunner$1.runReflectiveCall(SpringJUnit4ClassRunner.java:289)

        at org.junit.internal.runners.model.ReflectiveCallable.run(ReflectiveCallable.java:12)

        at org.springframework.test.context.junit4.SpringJUnit4ClassRunner.methodBlock(SpringJUnit4ClassRunner.java:291)

        at org.springframework.test.context.junit4.SpringJUnit4ClassRunner.runChild(SpringJUnit4ClassRunner.java:246)

        at org.springframework.test.context.junit4.SpringJUnit4ClassRunner.runChild(SpringJUnit4ClassRunner.java:97)

        at org.junit.runners.ParentRunner$4.run(ParentRunner.java:331)

        at org.junit.runners.ParentRunner$1.schedule(ParentRunner.java:79)

        at org.junit.runners.ParentRunner.runChildren(ParentRunner.java:329)

        at org.junit.runners.ParentRunner.access$100(ParentRunner.java:66)

        at org.junit.runners.ParentRunner$2.evaluate(ParentRunner.java:293)

        at org.springframework.test.context.junit4.statements.RunBeforeTestClassCallbacks.evaluate(RunBeforeTestClassCallbacks.java:61)

        at org.springframework.test.context.junit4.statements.RunAfterTestClassCallbacks.evaluate(RunAfterTestClassCallbacks.java:70)

        at org.junit.runners.ParentRunner$3.evaluate(ParentRunner.java:306)

        at org.junit.runners.ParentRunner.run(ParentRunner.java:413)

        at org.springframework.test.context.junit4.SpringJUnit4ClassRunner.run(SpringJUnit4ClassRunner.java:190)

        at org.apache.maven.surefire.junit4.JUnit4Provider.execute(JUnit4Provider.java:252)

        at org.apache.maven.surefire.junit4.JUnit4Provider.executeTestSet(JUnit4Provider.java:141)

        at org.apache.maven.surefire.junit4.JUnit4Provider.invoke(JUnit4Provider.java:112)

        at sun.reflect.NativeMethodAccessorImpl.invoke0(Native Method)

        at sun.reflect.NativeMethodAccessorImpl.invoke(NativeMethodAccessorImpl.java:62)

        at sun.reflect.DelegatingMethodAccessorImpl.invoke(DelegatingMethodAccessorImpl.java:43)

        at java.lang.reflect.Method.invoke(Method.java:498)

        at org.apache.maven.surefire.util.ReflectionUtils.invokeMethodWithArray(ReflectionUtils.java:189)

        at org.apache.maven.surefire.booter.ProviderFactory$ProviderProxy.invoke(ProviderFactory.java:165)

        at org.apache.maven.surefire.booter.ProviderFactory.invokeProvider(ProviderFactory.java:85)

        at org.apache.maven.surefire.booter.ForkedBooter.runSuitesInProcess(ForkedBooter.java:115)

        at org.apache.maven.surefire.booter.ForkedBooter.main(ForkedBooter.java:75)

Caused by: com.alibaba.nacos.shaded.io.grpc.StatusRuntimeException: UNAVAILABLE: io exception

        at com.alibaba.nacos.shaded.io.grpc.Status.asRuntimeException(Status.java:533)

        at com.alibaba.nacos.shaded.io.grpc.stub.ClientCalls$UnaryStreamToFuture.onClose(ClientCalls.java:490)

        at com.alibaba.nacos.shaded.io.grpc.PartialForwardingClientCallListener.onClose(PartialForwardingClientCallListener.java:39)

        at com.alibaba.nacos.shaded.io.grpc.ForwardingClientCallListener.onClose(ForwardingClientCallListener.java:23)

        at com.alibaba.nacos.shaded.io.grpc.ForwardingClientCallListener$SimpleForwardingClientCallListener.onClose(ForwardingClientCallListener.java:40)

        at com.alibaba.nacos.shaded.io.grpc.internal.CensusStatsModule$StatsClientInterceptor$1$1.onClose(CensusStatsModule.java:700)

        at com.alibaba.nacos.shaded.io.grpc.PartialForwardingClientCallListener.onClose(PartialForwardingClientCallListener.java:39)

        at com.alibaba.nacos.shaded.io.grpc.ForwardingClientCallListener.onClose(ForwardingClientCallListener.java:23)

        at com.alibaba.nacos.shaded.io.grpc.ForwardingClientCallListener$SimpleForwardingClientCallListener.onClose(ForwardingClientCallListener.java:40)

        at com.alibaba.nacos.shaded.io.grpc.internal.CensusTracingModule$TracingClientInterceptor$1$1.onClose(CensusTracingModule.java:399)

        at com.alibaba.nacos.shaded.io.grpc.internal.ClientCallImpl.closeObserver(ClientCallImpl.java:510)

        at com.alibaba.nacos.shaded.io.grpc.internal.ClientCallImpl.access$300(ClientCallImpl.java:66)

        at com.alibaba.nacos.shaded.io.grpc.internal.ClientCallImpl$ClientStreamListenerImpl.close(ClientCallImpl.java:630)

        at com.alibaba.nacos.shaded.io.grpc.internal.ClientCallImpl$ClientStreamListenerImpl.access$700(ClientCallImpl.java:518)

        at com.alibaba.nacos.shaded.io.grpc.internal.ClientCallImpl$ClientStreamListenerImpl$1StreamClosed.runInternal(ClientCallImpl.java:692)

        at com.alibaba.nacos.shaded.io.grpc.internal.ClientCallImpl$ClientStreamListenerImpl$1StreamClosed.runInContext(ClientCallImpl.java:681)

        at com.alibaba.nacos.shaded.io.grpc.internal.ContextRunnable.run(ContextRunnable.java:37)

        at com.alibaba.nacos.shaded.io.grpc.internal.SerializingExecutor.run(SerializingExecutor.java:123)

        at java.util.concurrent.ThreadPoolExecutor.runWorker(ThreadPoolExecutor.java:1149)

        at java.util.concurrent.ThreadPoolExecutor$Worker.run(ThreadPoolExecutor.java:624)

        at java.lang.Thread.run(Thread.java:748)

Caused by: com.alibaba.nacos.shaded.io.grpc.netty.shaded.io.netty.channel.AbstractChannel$AnnotatedConnectException: Connection refused: no further information: /127.0.0.1:9848

Caused by: java.net.ConnectException: Connection refused: no further information

        at sun.nio.ch.SocketChannelImpl.checkConnect(Native Method)

        at sun.nio.ch.SocketChannelImpl.finishConnect(SocketChannelImpl.java:717)

        at com.alibaba.nacos.shaded.io.grpc.netty.shaded.io.netty.channel.socket.nio.NioSocketChannel.doFinishConnect(NioSocketChannel.java:327)

        at com.alibaba.nacos.shaded.io.grpc.netty.shaded.io.netty.channel.nio.AbstractNioChannel$AbstractNioUnsafe.finishConnect(AbstractNioChannel.java:336)

        at com.alibaba.nacos.shaded.io.grpc.netty.shaded.io.netty.channel.nio.NioEventLoop.processSelectedKey(NioEventLoop.java:685)

        at com.alibaba.nacos.shaded.io.grpc.netty.shaded.io.netty.channel.nio.NioEventLoop.processSelectedKeysOptimized(NioEventLoop.java:632)

        at com.alibaba.nacos.shaded.io.grpc.netty.shaded.io.netty.channel.nio.NioEventLoop.processSelectedKeys(NioEventLoop.java:549)

        at com.alibaba.nacos.shaded.io.grpc.netty.shaded.io.netty.channel.nio.NioEventLoop.run(NioEventLoop.java:511)

        at com.alibaba.nacos.shaded.io.grpc.netty.shaded.io.netty.util.concurrent.SingleThreadEventExecutor$5.run(SingleThreadEventExecutor.java:918)

        at com.alibaba.nacos.shaded.io.grpc.netty.shaded.io.netty.util.internal.ThreadExecutorMap$2.run(ThreadExecutorMap.java:74)

        at com.alibaba.nacos.shaded.io.grpc.netty.shaded.io.netty.util.concurrent.FastThreadLocalRunnable.run(FastThreadLocalRunnable.java:30)

        at java.lang.Thread.run(Thread.java:748)


2022-05-19 14:13:56.949 ERROR 29080 --- [           main] c.a.n.c.remote.client.grpc.GrpcClient    : Server check fail, please check server 127.0.0.1 ,port 9848 is available , error ={}


java.util.concurrent.ExecutionException: com.alibaba.nacos.shaded.io.grpc.StatusRuntimeException: UNAVAILABLE: io exception

        at com.alibaba.nacos.shaded.com.google.common.util.concurrent.AbstractFuture.getDoneValue(AbstractFuture.java:566)

        at com.alibaba.nacos.shaded.com.google.common.util.concurrent.AbstractFuture.get(AbstractFuture.java:445)

        at com.alibaba.nacos.common.remote.client.grpc.GrpcClient.serverCheck(GrpcClient.java:148)

        at com.alibaba.nacos.common.remote.client.grpc.GrpcClient.connectToServer(GrpcClient.java:264)

        at com.alibaba.nacos.common.remote.client.RpcClient.start(RpcClient.java:390)

        at com.alibaba.nacos.client.config.impl.ClientWorker$ConfigRpcTransportClient.ensureRpcClient(ClientWorker.java:885)

        at com.alibaba.nacos.client.config.impl.ClientWorker$ConfigRpcTransportClient.getOneRunningClient(ClientWorker.java:1044)

        at com.alibaba.nacos.client.config.impl.ClientWorker$ConfigRpcTransportClient.queryConfig(ClientWorker.java:940)

        at com.alibaba.nacos.client.config.impl.ClientWorker.getServerConfig(ClientWorker.java:397)

        at com.alibaba.nacos.client.config.NacosConfigService.getConfigInner(NacosConfigService.java:166)

        at com.alibaba.nacos.client.config.NacosConfigService.getConfig(NacosConfigService.java:94)

        at com.alibaba.cloud.nacos.client.NacosPropertySourceBuilder.loadNacosData(NacosPropertySourceBuilder.java:85)

        at com.alibaba.cloud.nacos.client.NacosPropertySourceBuilder.build(NacosPropertySourceBuilder.java:73)

        at com.alibaba.cloud.nacos.client.NacosPropertySourceLocator.loadNacosPropertySource(NacosPropertySourceLocator.java:199)

        at com.alibaba.cloud.nacos.client.NacosPropertySourceLocator.loadNacosDataIfPresent(NacosPropertySourceLocator.java:186)

        at com.alibaba.cloud.nacos.client.NacosPropertySourceLocator.loadNacosConfiguration(NacosPropertySourceLocator.java:158)

        at com.alibaba.cloud.nacos.client.NacosPropertySourceLocator.loadSharedConfiguration(NacosPropertySourceLocator.java:116)

        at com.alibaba.cloud.nacos.client.NacosPropertySourceLocator.locate(NacosPropertySourceLocator.java:101)

        at org.springframework.cloud.bootstrap.config.PropertySourceLocator.locateCollection(PropertySourceLocator.java:52)

        at org.springframework.cloud.bootstrap.config.PropertySourceLocator.locateCollection(PropertySourceLocator.java:47)

        at org.springframework.cloud.bootstrap.config.PropertySourceBootstrapConfiguration.initialize(PropertySourceBootstrapConfiguration.java:98)

        at org.springframework.boot.SpringApplication.applyInitializers(SpringApplication.java:623)

        at org.springframework.boot.SpringApplication.prepareContext(SpringApplication.java:367)

        at org.springframework.boot.SpringApplication.run(SpringApplication.java:311)

        at org.springframework.boot.test.context.SpringBootContextLoader.loadContext(SpringBootContextLoader.java:120)

        at org.springframework.test.context.cache.DefaultCacheAwareContextLoaderDelegate.loadContextInternal(DefaultCacheAwareContextLoaderDelegate.java:99)

        at org.springframework.test.context.cache.DefaultCacheAwareContextLoaderDelegate.loadContext(DefaultCacheAwareContextLoaderDelegate.java:124)

        at org.springframework.test.context.support.DefaultTestContext.getApplicationContext(DefaultTestContext.java:123)

        at org.springframework.test.context.web.ServletTestExecutionListener.setUpRequestContextIfNecessary(ServletTestExecutionListener.java:190)

        at org.springframework.test.context.web.ServletTestExecutionListener.prepareTestInstance(ServletTestExecutionListener.java:132)

        at org.springframework.test.context.TestContextManager.prepareTestInstance(TestContextManager.java:244)

        at org.springframework.test.context.junit4.SpringJUnit4ClassRunner.createTest(SpringJUnit4ClassRunner.java:227)

        at org.springframework.test.context.junit4.SpringJUnit4ClassRunner$1.runReflectiveCall(SpringJUnit4ClassRunner.java:289)

        at org.junit.internal.runners.model.ReflectiveCallable.run(ReflectiveCallable.java:12)

        at org.springframework.test.context.junit4.SpringJUnit4ClassRunner.methodBlock(SpringJUnit4ClassRunner.java:291)

        at org.springframework.test.context.junit4.SpringJUnit4ClassRunner.runChild(SpringJUnit4ClassRunner.java:246)

        at org.springframework.test.context.junit4.SpringJUnit4ClassRunner.runChild(SpringJUnit4ClassRunner.java:97)

        at org.junit.runners.ParentRunner$4.run(ParentRunner.java:331)

        at org.junit.runners.ParentRunner$1.schedule(ParentRunner.java:79)

        at org.junit.runners.ParentRunner.runChildren(ParentRunner.java:329)

        at org.junit.runners.ParentRunner.access$100(ParentRunner.java:66)

        at org.junit.runners.ParentRunner$2.evaluate(ParentRunner.java:293)

        at org.springframework.test.context.junit4.statements.RunBeforeTestClassCallbacks.evaluate(RunBeforeTestClassCallbacks.java:61)

        at org.springframework.test.context.junit4.statements.RunAfterTestClassCallbacks.evaluate(RunAfterTestClassCallbacks.java:70)

        at org.junit.runners.ParentRunner$3.evaluate(ParentRunner.java:306)

        at org.junit.runners.ParentRunner.run(ParentRunner.java:413)

        at org.springframework.test.context.junit4.SpringJUnit4ClassRunner.run(SpringJUnit4ClassRunner.java:190)

        at org.apache.maven.surefire.junit4.JUnit4Provider.execute(JUnit4Provider.java:252)

        at org.apache.maven.surefire.junit4.JUnit4Provider.executeTestSet(JUnit4Provider.java:141)

        at org.apache.maven.surefire.junit4.JUnit4Provider.invoke(JUnit4Provider.java:112)

        at sun.reflect.NativeMethodAccessorImpl.invoke0(Native Method)

        at sun.reflect.NativeMethodAccessorImpl.invoke(NativeMethodAccessorImpl.java:62)

        at sun.reflect.DelegatingMethodAccessorImpl.invoke(DelegatingMethodAccessorImpl.java:43)

        at java.lang.reflect.Method.invoke(Method.java:498)

        at org.apache.maven.surefire.util.ReflectionUtils.invokeMethodWithArray(ReflectionUtils.java:189)

        at org.apache.maven.surefire.booter.ProviderFactory$ProviderProxy.invoke(ProviderFactory.java:165)

        at org.apache.maven.surefire.booter.ProviderFactory.invokeProvider(ProviderFactory.java:85)

        at org.apache.maven.surefire.booter.ForkedBooter.runSuitesInProcess(ForkedBooter.java:115)

        at org.apache.maven.surefire.booter.ForkedBooter.main(ForkedBooter.java:75)

Caused by: com.alibaba.nacos.shaded.io.grpc.StatusRuntimeException: UNAVAILABLE: io exception

        at com.alibaba.nacos.shaded.io.grpc.Status.asRuntimeException(Status.java:533)

        at com.alibaba.nacos.shaded.io.grpc.stub.ClientCalls$UnaryStreamToFuture.onClose(ClientCalls.java:490)

        at com.alibaba.nacos.shaded.io.grpc.PartialForwardingClientCallListener.onClose(PartialForwardingClientCallListener.java:39)

        at com.alibaba.nacos.shaded.io.grpc.ForwardingClientCallListener.onClose(ForwardingClientCallListener.java:23)

        at com.alibaba.nacos.shaded.io.grpc.ForwardingClientCallListener$SimpleForwardingClientCallListener.onClose(ForwardingClientCallListener.java:40)

        at com.alibaba.nacos.shaded.io.grpc.internal.CensusStatsModule$StatsClientInterceptor$1$1.onClose(CensusStatsModule.java:700)

        at com.alibaba.nacos.shaded.io.grpc.PartialForwardingClientCallListener.onClose(PartialForwardingClientCallListener.java:39)

        at com.alibaba.nacos.shaded.io.grpc.ForwardingClientCallListener.onClose(ForwardingClientCallListener.java:23)

        at com.alibaba.nacos.shaded.io.grpc.ForwardingClientCallListener$SimpleForwardingClientCallListener.onClose(ForwardingClientCallListener.java:40)

        at com.alibaba.nacos.shaded.io.grpc.internal.CensusTracingModule$TracingClientInterceptor$1$1.onClose(CensusTracingModule.java:399)

        at com.alibaba.nacos.shaded.io.grpc.internal.ClientCallImpl.closeObserver(ClientCallImpl.java:510)

        at com.alibaba.nacos.shaded.io.grpc.internal.ClientCallImpl.access$300(ClientCallImpl.java:66)

        at com.alibaba.nacos.shaded.io.grpc.internal.ClientCallImpl$ClientStreamListenerImpl.close(ClientCallImpl.java:630)

        at com.alibaba.nacos.shaded.io.grpc.internal.ClientCallImpl$ClientStreamListenerImpl.access$700(ClientCallImpl.java:518)

        at com.alibaba.nacos.shaded.io.grpc.internal.ClientCallImpl$ClientStreamListenerImpl$1StreamClosed.runInternal(ClientCallImpl.java:692)

        at com.alibaba.nacos.shaded.io.grpc.internal.ClientCallImpl$ClientStreamListenerImpl$1StreamClosed.runInContext(ClientCallImpl.java:681)

        at com.alibaba.nacos.shaded.io.grpc.internal.ContextRunnable.run(ContextRunnable.java:37)

        at com.alibaba.nacos.shaded.io.grpc.internal.SerializingExecutor.run(SerializingExecutor.java:123)

        at java.util.concurrent.ThreadPoolExecutor.runWorker(ThreadPoolExecutor.java:1149)

        at java.util.concurrent.ThreadPoolExecutor$Worker.run(ThreadPoolExecutor.java:624)

        at java.lang.Thread.run(Thread.java:748)

Caused by: com.alibaba.nacos.shaded.io.grpc.netty.shaded.io.netty.channel.AbstractChannel$AnnotatedConnectException: Connection refused: no further information: /127.0.0.1:9848

Caused by: java.net.ConnectException: Connection refused: no further information

        at sun.nio.ch.SocketChannelImpl.checkConnect(Native Method)

        at sun.nio.ch.SocketChannelImpl.finishConnect(SocketChannelImpl.java:717)

        at com.alibaba.nacos.shaded.io.grpc.netty.shaded.io.netty.channel.socket.nio.NioSocketChannel.doFinishConnect(NioSocketChannel.java:327)

        at com.alibaba.nacos.shaded.io.grpc.netty.shaded.io.netty.channel.nio.AbstractNioChannel$AbstractNioUnsafe.finishConnect(AbstractNioChannel.java:336)

        at com.alibaba.nacos.shaded.io.grpc.netty.shaded.io.netty.channel.nio.NioEventLoop.processSelectedKey(NioEventLoop.java:685)

        at com.alibaba.nacos.shaded.io.grpc.netty.shaded.io.netty.channel.nio.NioEventLoop.processSelectedKeysOptimized(NioEventLoop.java:632)

        at com.alibaba.nacos.shaded.io.grpc.netty.shaded.io.netty.channel.nio.NioEventLoop.processSelectedKeys(NioEventLoop.java:549)

        at com.alibaba.nacos.shaded.io.grpc.netty.shaded.io.netty.channel.nio.NioEventLoop.run(NioEventLoop.java:511)

        at com.alibaba.nacos.shaded.io.grpc.netty.shaded.io.netty.util.concurrent.SingleThreadEventExecutor$5.run(SingleThreadEventExecutor.java:918)

        at com.alibaba.nacos.shaded.io.grpc.netty.shaded.io.netty.util.internal.ThreadExecutorMap$2.run(ThreadExecutorMap.java:74)

        at com.alibaba.nacos.shaded.io.grpc.netty.shaded.io.netty.util.concurrent.FastThreadLocalRunnable.run(FastThreadLocalRunnable.java:30)

        at java.lang.Thread.run(Thread.java:748)


Results :


Tests in error:

  contextLoads(org.springblade.flow.test.BladeTest): Failed to load ApplicationContext


Tests run: 1, Failures: 0, Errors: 1, Skipped: 0


[INFO] ------------------------------------------------------------------------

[INFO] Reactor Summary:

[INFO]

[INFO] BladeX ............................................. SUCCESS [  0.831 s]

[INFO] blade-common ....................................... SUCCESS [  3.028 s]

[INFO] blade-service-api .................................. SUCCESS [  0.438 s]

[INFO] blade-user-api ..................................... SUCCESS [  2.331 s]

[INFO] blade-system-api ................................... SUCCESS [  2.454 s]

[INFO] blade-auth ......................................... SUCCESS [  4.843 s]

[INFO] blade-gateway ...................................... SUCCESS [  3.259 s]

[INFO] blade-ops .......................................... SUCCESS [  0.056 s]

[INFO] blade-admin ........................................ SUCCESS [  2.781 s]

[INFO] blade-dict-api ..................................... SUCCESS [  2.185 s]

[INFO] blade-develop ...................................... SUCCESS [  4.980 s]

[INFO] blade-scope-api .................................... SUCCESS [  1.770 s]

[INFO] blade-ops-api ...................................... SUCCESS [  0.085 s]

[INFO] blade-flow-api ..................................... SUCCESS [  1.420 s]

[INFO] blade-flow ......................................... FAILURE [ 28.510 s]

[INFO] blade-log .......................................... SKIPPED

[INFO] blade-report ....................................... SKIPPED

[INFO] blade-resource-api ................................. SKIPPED

[INFO] blade-resource ..................................... SKIPPED

[INFO] blade-swagger ...................................... SKIPPED

[INFO] blade-turbine ...................................... SKIPPED

[INFO] bmdj-common ........................................ SKIPPED

[INFO] bmdj-rent-api ...................................... SKIPPED

[INFO] blade-xxljob ....................................... SKIPPED

[INFO] blade-xxljob-admin ................................. SKIPPED

[INFO] blade-plugin ....................................... SKIPPED

[INFO] blade-plugin-api ................................... SKIPPED

[INFO] blade-desk-api ..................................... SKIPPED

[INFO] blade-service ...................................... SKIPPED

[INFO] blade-desk ......................................... SKIPPED

[INFO] blade-system ....................................... SKIPPED

[INFO] blade-user ......................................... SKIPPED

[INFO] bmdj-user-api ...................................... SKIPPED

[INFO] bmdj-user .......................................... SKIPPED

[INFO] bmdj-pay-api ....................................... SKIPPED

[INFO] bmdj-rent .......................................... SKIPPED

[INFO] bmdj-pay ........................................... SKIPPED

[INFO] bmdj-map ........................................... SKIPPED

[INFO] bmdj-map-api ....................................... SKIPPED

[INFO] ------------------------------------------------------------------------

[INFO] BUILD FAILURE

[INFO] ------------------------------------------------------------------------

[INFO] Total time: 01:01 min

[INFO] Finished at: 2022-05-19T14:14:06+08:00

1条回答
  • mvn clean package -DskipTests

    试下这个

    0 讨论(0)
提交回复